{"text_format":"1","workbook":"xlsx","n_sheets":5,"sheets":["Servicing Calculator","Expense worksheet","Nuts and Bolts","Lookups","Rental Incomes"],"not_rendered":{"charts":0,"images":2,"macros":1,"external_links":0,"defined_names":2,"comments":1,"pivot_tables":0},"unopened":[],"bounds":{"document_bytes":16777216,"sheet_cells":100000,"rows_first":2000,"rows_last":500,"rows_between":2000,"halvings":0,"cell_chars":16384,"cell_head_chars":4096},"cells_cut":0,"cells_raw":0,"read":"whole","date_system":"1900"}

{"sheet":"Servicing Calculator","index":0,"n_rows":81,"n_cols":27,"rows_kept":81,"cut":false,"hidden":false,"merged":[[13,5,13,6],[10,5,10,6],[72,5,72,6],[8,5,8,6],[9,5,9,6],[14,5,14,6],[16,5,16,6],[7,7,7,8],[15,5,15,6],[15,7,15,8],[19,5,19,6],[20,5,20,6],[36,7,36,8],[37,7,37,8],[38,7,38,8],[17,5,17,6],[18,5,18,6],[21,5,21,6],[3,18,3,21],[4,18,4,21],[8,17,9,17],[9,18,19,21],[20,18,52,21],[37,9,37,12],[36,9,36,12],[7,9,7,12],[4,9,4,11],[0,15,78,15],[0,2,0,13],[25,5,25,6],[57,9,57,13],[46,7,46,8],[45,5,45,6],[14,9,14,12],[16,9,16,12],[4,5,4,6],[7,5,7,6],[3,4,3,6],[24,5,24,6],[4,7,4,8],[8,7,8,8],[23,2,23,4],[80,2,80,12],[58,9,58,13],[39,9,39,12],[40,9,40,12],[41,9,41,12],[42,9,42,12],[43,9,43,12],[44,9,44,12],[73,5,73,6],[60,9,61,12],[47,7,47,8],[47,5,47,6],[39,5,39,6],[40,5,40,6],[41,5,41,6],[42,5,42,6],[79,2,79,12],[78,2,78,12],[54,2,54,12],[44,7,44,8],[59,9,59,13],[47,9,47,12],[38,9,38,12],[45,7,45,8],[46,5,46,6],[36,5,36,6],[37,5,37,6],[38,5,38,6],[40,7,40,8],[43,5,43,6],[42,7,42,8],[43,7,43,8],[39,7,39,8],[45,9,45,12],[41,7,41,8],[46,9,46,12],[44,5,44,6],[10,9,10,12],[21,7,21,8],[24,9,24,12],[25,9,25,12],[21,9,21,12],[13,9,13,12],[8,9,8,12],[9,9,9,12],[25,7,25,8],[20,9,20,12],[13,7,13,8],[10,7,10,8],[15,9,15,12],[17,7,17,8],[18,7,18,8],[19,7,19,8],[20,7,20,8],[17,9,17,12],[18,9,18,12],[19,9,19,12],[24,7,24,8],[9,7,9,8],[14,7,14,8],[16,7,16,8]]}
[]
[null,null,"Servicing Calculator",null,null,null,null,null,null," "]
[]
[null,null,"Loan details:",null,null,null,null,null,null,null,null,null,"Version 3.3     ",null,null,null," ",null,"To unlock any fields the password is"]
[null,null,"New loan amount ($)",null,null,"Interest rate (%)",null,null,null,"P&I term (mths)",null,null,null,null,null,null," ",null,"Ffederal123"]
[null,null,"Loan product",null,"Select - mandatory"]
[]
[null,null,"Applicant(s) details:",null,"Applicant 1","Applicant 2",null,"Applicant 3",null,"Applicant 4"]
[null,null,"Borrower type"]
[null,null,"Relationship status",null,null,null,null,null,null,null,null,null,null,null,null,null,null,null,null,null,null,null," "]
{"$rows_left_out":72}
{"sheet":"Expense worksheet","index":1,"n_rows":35,"n_cols":15,"rows_kept":35,"cut":false,"hidden":true,"merged":[[13,1,13,2],[2,1,2,5],[3,1,3,5],[8,1,8,2],[9,1,9,2],[10,1,10,2],[11,1,11,2],[12,1,12,2],[27,1,27,2],[28,1,28,2],[14,1,14,2],[15,1,15,2],[16,1,16,2],[17,1,17,2],[18,1,18,2],[19,1,19,2],[34,3,34,6],[21,3,21,6],[20,1,20,2],[21,1,21,2],[7,1,7,2],[22,1,22,2],[33,1,33,2],[34,1,34,2],[29,1,29,2],[30,1,30,2],[31,1,31,2],[32,1,32,2],[23,1,23,2],[24,1,24,2],[25,1,25,2],[26,1,26,2]]}
[]
[null,"Monthly living expenses"]
[null,"Please add the individual borrowers estimated expenses below."]
[null,"Once completed the total amount for all borrowers will pre-fill on the servicing calculator)"]
[]
[]
[null,null,null,"Applicant 1","Applicant 2","Applicant 3","Applicant 4"]
[null,"Hem Comparable",null,"Monthly","Monthly","Monthly","Monthly"]
[null,"Childcare"]
[null,"Clothing & Personal Care"]
{"$rows_left_out":26}
{"sheet":"Nuts and Bolts","index":2,"n_rows":106,"n_cols":38,"rows_kept":106,"cut":false,"hidden":true,"merged":[[11,6,12,8],[70,2,70,3],[70,4,70,5],[70,6,70,9],[1,3,2,3],[1,4,2,4],[1,5,2,5],[1,6,2,6],[1,9,2,9],[79,2,79,3],[79,4,79,5],[79,6,79,9],[13,6,13,9],[14,6,14,9],[18,0,18,2],[26,0,26,2],[29,0,29,2],[19,0,19,2],[20,0,20,2],[21,0,21,2],[22,0,22,2],[23,0,23,2],[24,0,24,2],[25,0,25,2],[1,10,2,10],[1,11,2,11],[1,12,2,12],[1,13,2,13],[1,14,2,14],[1,24,2,24],[1,25,2,25],[1,33,2,33],[13,14,13,17],[1,28,2,28],[1,29,2,29],[1,17,2,17],[1,18,2,18],[1,19,2,19],[1,22,2,22],[1,23,2,23],[14,14,14,17],[13,25,13,28],[14,25,14,28],[13,33,13,36],[14,33,14,36]]}
["Income & Expenses",null,null,"Applicant 1",null,null,"First Choice","First Choice Plus","First Freedom",null,null,"Applicant 2",null,null,"First Choice","First Choice Plus","First Freedom",null,null,"Income & Expenses",null,null,"Applicant 3",null,null,"First Choice","First Choice Plus","First Freedom",null,null,"Applicant 4",null,null,"First Choice","First Choice Plus","First Freedom"]
["Income Type",null,null,null,"Frequency","Mthly Equiv","Allowed",null,null,"Total Usable","Verified By:\nSelect from the list","$","Frequency","Mthly Equiv","Allowed",null,null,"Total Usable","Verified By:\nSelect from the list","Income Type",null,null,null,"Frequency","Mthly Equiv","Allowed",null,null,"Total Usable","Verified By:\nSelect from the list",null,null,null,"Allowed",null,null,null,"Verified By:"]
[null,null,null,null,null,null,null,null,null,null,null,null,null,null,null,null,null,null,null,null,null,null,null,null,null,null,null,null,null,null,"$","Frequency","Mthly Equiv",null,null,null,"Total Usable","Select from list"]
["PAYG","Base",null,{"$f":"'Servicing Calculator'!E15","v":0},"pa",{"$f":"D4/12","v":0},1,1,1,{"$f":"IF('Servicing Calculator'!$E$6=\"First Choice\",(F4*G4),IF('Servicing Calculator'!$E$6=\"First Choice Plus\",(F4*H4),IF('Servicing Calculator'!$E$6=\"First Freedom\",(F4*I4),IF('Servicing Calculator'!$E$6=\"First Business 30\",(F4*I4)))))","v":false},null,{"$f":"'Servicing Calculator'!F15","v":0},"pa",{"$f":"L4/12","v":0},1,1,1,{"$f":"IF('Servicing Calculator'!$E$6=\"First Choice\",(N4*O4),IF('Servicing Calculator'!$E$6=\"First Choice Plus\",(N4*P4),IF('Servicing Calculator'!$E$6=\"First Freedom\",(N4*Q4),IF('Servicing Calculator'!$E$6=\"First Business 30\",(N4*Q4)))))","v":false},null,"PAYG",null,"Base",{"$f":"'Servicing Calculator'!H15","v":0},"pa",{"$f":"W4/12","v":0},1,1,1,{"$f":"IF('Servicing Calculator'!$E$6=\"First Choice\",(Y4*Z4),IF('Servicing Calculator'!$E$6=\"First Choice Plus\",(Y4*AA4),IF('Servicing Calculator'!$E$6=\"First Freedom\",(Y4*AB4),IF('Servicing Calculator'!$E$6=\"First Business 30\",(Y4*AB4)))))","v":false},null,{"$f":"'Servicing Calculator'!J15","v":0},"pa",{"$f":"AE4/12","v":0},1,1,1,{"$f":"IF('Servicing Calculator'!$E$6=\"First Choice\",(AG4*AH4),IF('Servicing Calculator'!$E$6=\"First Choice Plus\",(AG4*AI4),IF('Servicing Calculator'!$E$6=\"First Freedom\",(AG4*AJ4),IF('Servicing Calculator'!$E$6=\"First Business 30\",(AG4*AJ4)))))","v":false}]
[null,"Commission/bonus",null,{"$f":"'Servicing Calculator'!E16","v":0},"pa",{"$f":"IF(E5=\"Weekly\",(D5*52/12),IF(E5=\"Fortnightly\",(D5*26/12),IF(E7=\"PA\",(D5/12),D5)))","v":0},1,1,1,{"$f":"IF('Servicing Calculator'!$E$6=\"First Choice\",(F5*G5),IF('Servicing Calculator'!$E$6=\"First Choice Plus\",(F5*H5),IF('Servicing Calculator'!$E$6=\"First Freedom\",(F5*I5),IF('Servicing Calculator'!$E$6=\"First Business 30\",(F5*I5)))))","v":false},null,{"$f":"'Servicing Calculator'!F16","v":0},"pa",{"$f":"IF(M5=\"Weekly\",(L5*52/12),IF(M5=\"Fortnightly\",(L5*26/12),IF(M7=\"PA\",(L5/12),D5)))","v":0},1,1,1,{"$f":"IF('Servicing Calculator'!$E$6=\"First Choice\",(N5*O5),IF('Servicing Calculator'!$E$6=\"First Choice Plus\",(N5*P5),IF('Servicing Calculator'!$E$6=\"First Freedom\",(N5*Q5),IF('Servicing Calculator'!$E$6=\"First Business 30\",(N5*Q5)))))","v":false},null,null,null,"Commission/bonus",{"$f":"'Servicing Calculator'!H16","v":0},"pa",{"$f":"IF(X5=\"Weekly\",(W5*52/12),IF(X5=\"Fortnightly\",(W5*26/12),IF(X7=\"PA\",(W5/12),O5)))","v":0},1,1,1,{"$f":"IF('Servicing Calculator'!$E$6=\"First Choice\",(Y5*Z5),IF('Servicing Calculator'!$E$6=\"First Choice Plus\",(Y5*AA5),IF('Servicing Calculator'!$E$6=\"First Freedom\",(Y5*AB5),IF('Servicing Calculator'!$E$6=\"First Business 30\",(Y5*AB5)))))","v":false},null,{"$f":"'Servicing Calculator'!J16","v":0},"pa",{"$f":"IF(AF5=\"Weekly\",(AE5*52/12),IF(AF5=\"Fortnightly\",(AE5*26/12),IF(AF7=\"PA\",(AE5/12),W5)))","v":0},1,1,1,{"$f":"IF('Servicing Calculator'!$E$6=\"First Choice\",(AG5*AH5),IF('Servicing Calculator'!$E$6=\"First Choice Plus\",(AG5*AI5),IF('Servicing Calculator'!$E$6=\"First Freedom\",(AG5*AJ5),IF('Servicing Calculator'!$E$6=\"First Business 30\",(AG5*AJ5)))))","v":false}]
["Self Employed ABN >12 mths","Director Wages",null,{"$f":"'Servicing Calculator'!E18","v":0},"pa",{"$f":"IF(E6=\"Weekly\",(D6*52/12),IF(E6=\"Fortnightly\",(D6*26/12),IF(E6=\"PA\",(D6/12),D6)))","v":0},1,1,1,{"$f":"IF('Servicing Calculator'!$E$6=\"First Choice\",(F6*G6),IF('Servicing Calculator'!$E$6=\"First Choice Plus\",(F6*H6),IF('Servicing Calculator'!$E$6=\"First Freedom\",(F6*I6),IF('Servicing Calculator'!$E$6=\"First Business 30\",(F6*I6)))))","v":false},null,{"$f":"'Servicing Calculator'!F18","v":0},"pa",{"$f":"IF(M6=\"Weekly\",(L6*52/12),IF(M6=\"Fortnightly\",(L6*26/12),IF(M7=\"PA\",(L6/12),D6)))","v":0},1,1,1,{"$f":"IF('Servicing Calculator'!$E$6=\"First Choice\",(N6*O6),IF('Servicing Calculator'!$E$6=\"First Choice Plus\",(N6*P6),IF('Servicing Calculator'!$E$6=\"First Freedom\",(N6*Q6),IF('Servicing Calculator'!$E$6=\"First Business 30\",(N6*Q6)))))","v":false},null,null,null,"Director Wages",{"$f":"'Servicing Calculator'!H18","v":0},"pa",{"$f":"IF(X6=\"Weekly\",(W6*52/12),IF(X6=\"Fortnightly\",(W6*26/12),IF(X7=\"PA\",(W6/12),O6)))","v":0},1,1,1,{"$f":"IF('Servicing Calculator'!$E$6=\"First Choice\",(Y6*Z6),IF('Servicing Calculator'!$E$6=\"First Choice Plus\",(Y6*AA6),IF('Servicing Calculator'!$E$6=\"First Freedom\",(Y6*AB6),IF('Servicing Calculator'!$E$6=\"First Business 30\",(Y6*AB6)))))","v":false},null,{"$f":"'Servicing Calculator'!J18","v":0},"pa",{"$f":"IF(AF6=\"Weekly\",(AE6*52/12),IF(AF6=\"Fortnightly\",(AE6*26/12),IF(AF7=\"PA\",(AE6/12),W6)))","v":0},1,1,1,{"$f":"IF('Servicing Calculator'!$E$6=\"First Choice\",(AG6*AH6),IF('Servicing Calculator'!$E$6=\"First Choice Plus\",(AG6*AI6),IF('Servicing Calculator'!$E$6=\"First Freedom\",(AG6*AJ6),IF('Servicing Calculator'!$E$6=\"First Business 30\",(AG6*AJ6)))))","v":false}]
[null,"Business NPBT",null,{"$f":"'Servicing Calculator'!E19","v":0},"pa",{"$f":"IF(E7=\"Weekly\",(D7*52/12),IF(E7=\"Fortnightly\",(D7*26/12),IF(E7=\"PA\",(D7/12),D7)))","v":0},1,1,1,{"$f":"IF('Servicing Calculator'!$E$6=\"First Choice\",(F7*G7),IF('Servicing Calculator'!$E$6=\"First Choice Plus\",(F7*H7),IF('Servicing Calculator'!$E$6=\"First Freedom\",(F7*I7),IF('Servicing Calculator'!$E$6=\"First Business 30\",(F7*I7)))))","v":false},null,{"$f":"'Servicing Calculator'!F19","v":0},"pa",{"$f":"IF(M7=\"Weekly\",(L7*52/12),IF(M7=\"Fortnightly\",(L7*26/12),IF(M9=\"PA\",(L7/12),D7)))","v":0},1,1,1,{"$f":"IF('Servicing Calculator'!$E$6=\"First Choice\",(N7*O7),IF('Servicing Calculator'!$E$6=\"First Choice Plus\",(N7*P7),IF('Servicing Calculator'!$E$6=\"First Freedom\",(N7*Q7),IF('Servicing Calculator'!$E$6=\"First Business 30\",(N7*Q7)))))","v":false},null,null,null,"Profit Share",{"$f":"'Servicing Calculator'!H19","v":0},"pa",0,1,1,1,{"$f":"IF('Servicing Calculator'!$E$6=\"First Choice\",(Y7*Z7),IF('Servicing Calculator'!$E$6=\"First Choice Plus\",(Y7*AA7),IF('Servicing Calculator'!$E$6=\"First Freedom\",(Y7*AB7),IF('Servicing Calculator'!$E$6=\"First Business 30\",(Y7*AB7)))))","v":false},null,{"$f":"'Servicing Calculator'!J19","v":0},"pa",0,1,1,1,{"$f":"IF('Servicing Calculator'!$E$6=\"First Choice\",(AG7*AH7),IF('Servicing Calculator'!$E$6=\"First Choice Plus\",(AG7*AI7),IF('Servicing Calculator'!$E$6=\"First Freedom\",(AG7*AJ7),IF('Servicing Calculator'!$E$6=\"First Business 30\",(AG7*AJ7)))))","v":false}]
[null,"Addbacks",null,{"$f":"'Servicing Calculator'!E20","v":0},"pa",0,1,1,1,{"$f":"IF('Servicing Calculator'!$E$6=\"First Choice\",(F8*G8),IF('Servicing Calculator'!$E$6=\"First Choice Plus\",(F8*H8),IF('Servicing Calculator'!$E$6=\"First Freedom\",(F8*I8),IF('Servicing Calculator'!$E$6=\"First Business 30\",(F8*I8)))))","v":false},null,{"$f":"'Servicing Calculator'!F20","v":0},"pa",{"$f":"IF(M8=\"Weekly\",(L8*52/12),IF(M8=\"Fortnightly\",(L8*26/12),IF(M10=\"PA\",(L8/12),D8)))","v":0},1,1,1,{"$f":"IF('Servicing Calculator'!$E$6=\"First Choice\",(N8*O8),IF('Servicing Calculator'!$E$6=\"First Choice Plus\",(N8*P8),IF('Servicing Calculator'!$E$6=\"First Freedom\",(N8*Q8),IF('Servicing Calculator'!$E$6=\"First Business 30\",(N8*Q8)))))","v":false},null,null,null,"Addbacks",{"$f":"'Servicing Calculator'!H20","v":0},"pa",0,1,1,1,{"$f":"IF('Servicing Calculator'!$E$6=\"First Choice\",(Y8*Z8),IF('Servicing Calculator'!$E$6=\"First Choice Plus\",(Y8*AA8),IF('Servicing Calculator'!$E$6=\"First Freedom\",(Y8*AB8),IF('Servicing Calculator'!$E$6=\"First Business 30\",(Y8*AB8)))))","v":false},null,{"$f":"'Servicing Calculator'!J20","v":0},"pa",0,1,1,1,{"$f":"IF('Servicing Calculator'!$E$6=\"First Choice\",(AG8*AH8),IF('Servicing Calculator'!$E$6=\"First Choice Plus\",(AG8*AI8),IF('Servicing Calculator'!$E$6=\"First Freedom\",(AG8*AJ8),IF('Servicing Calculator'!$E$6=\"First Business 30\",(AG8*AJ8)))))","v":false}]
["Property (use Rental Schedule ","Rent Residential",null,{"$f":"'Servicing Calculator'!E21","v":0},"pa",{"$f":"IF(E9=\"Weekly\",(D9*52/12),IF(E9=\"Fortnightly\",(D9*26/12),IF(E9=\"PA\",(D9/12),D9)))","v":0},0.8,0.9,0.9,{"$f":"IF('Servicing Calculator'!$E$6=\"First Choice\",(F9*G9),IF('Servicing Calculator'!$E$6=\"First Choice Plus\",(F9*H9),IF('Servicing Calculator'!$E$6=\"First Freedom\",(F9*I9),IF('Servicing Calculator'!$E$6=\"First Business 30\",(F9*I9)))))","v":false},null,{"$f":"'Servicing Calculator'!F21","v":0},"pa",0,0.8,0.9,0.9,{"$f":"IF('Servicing Calculator'!$E$6=\"First Choice\",(N9*O9),IF('Servicing Calculator'!$E$6=\"First Choice Plus\",(N9*P9),IF('Servicing Calculator'!$E$6=\"First Freedom\",(N9*Q9),IF('Servicing Calculator'!$E$6=\"First Business 30\",(N9*Q9)))))","v":false},null,"Property (use Rental Schedule ",null,"Rent Residential",{"$f":"'Servicing Calculator'!H21","v":0},"pa",0,0.8,0.9,0.9,{"$f":"IF('Servicing Calculator'!$E$6=\"First Choice\",(Y9*Z9),IF('Servicing Calculator'!$E$6=\"First Choice Plus\",(Y9*AA9),IF('Servicing Calculator'!$E$6=\"First Freedom\",(Y9*AB9),IF('Servicing Calculator'!$E$6=\"First Business 30\",(Y9*AB9)))))","v":false},null,{"$f":"'Servicing Calculator'!J21","v":0},"pa",0,0.8,0.9,0.9,{"$f":"IF('Servicing Calculator'!$E$6=\"First Choice\",(AG9*AH9),IF('Servicing Calculator'!$E$6=\"First Choice Plus\",(AG9*AI9),IF('Servicing Calculator'!$E$6=\"First Freedom\",(AG9*AJ9),IF('Servicing Calculator'!$E$6=\"First Business 30\",(AG9*AJ9)))))","v":false}]
["if insufficient room)","Rent Commercial",null,{"$f":"'Servicing Calculator'!E22","v":0},"pa",0,0.8,0.9,0.9,{"$f":"IF('Servicing Calculator'!$E$6=\"First Choice\",(F10*G10),IF('Servicing Calculator'!$E$6=\"First Choice Plus\",(F10*H10),IF('Servicing Calculator'!$E$6=\"First Freedom\",(F10*I10),IF('Servicing Calculator'!$E$6=\"First Business 30\",(F10*I10)))))","v":false},null,{"$f":"'Servicing Calculator'!F22","v":0},"pa",{"$f":"IF(M10=\"Weekly\",(L10*52/12),IF(M10=\"Fortnightly\",(L10*26/12),IF(M10=\"PA\",(L10/12),L10)))","v":0},0.8,0.9,0.9,{"$f":"IF('Servicing Calculator'!$E$6=\"First Choice\",(N10*O10),IF('Servicing Calculator'!$E$6=\"First Choice Plus\",(N10*P10),IF('Servicing Calculator'!$E$6=\"First Freedom\",(N10*Q10),IF('Servicing Calculator'!$E$6=\"First Business 30\",(N10*Q10)))))","v":false},null,"if insufficient room)",null,"Rent Commercial",{"$f":"'Servicing Calculator'!H22","v":0},"pa",0,0.8,0.9,0.9,{"$f":"IF('Servicing Calculator'!$E$6=\"First Choice\",(Y10*Z10),IF('Servicing Calculator'!$E$6=\"First Choice Plus\",(Y10*AA10),IF('Servicing Calculator'!$E$6=\"First Freedom\",(Y10*AB10),IF('Servicing Calculator'!$E$6=\"First Business 30\",(Y10*AB10)))))","v":false},null,{"$f":"'Servicing Calculator'!J22","v":0},"pa",0,0.8,0.9,0.9,{"$f":"IF('Servicing Calculator'!$E$6=\"First Choice\",(AG10*AH10),IF('Servicing Calculator'!$E$6=\"First Choice Plus\",(AG10*AI10),IF('Servicing Calculator'!$E$6=\"First Freedom\",(AG10*AJ10),IF('Servicing Calculator'!$E$6=\"First Business 30\",(AG10*AJ10)))))","v":false}]
{"$rows_left_out":97}
{"sheet":"Lookups","index":3,"n_rows":66,"n_cols":15,"rows_kept":66,"cut":false,"hidden":true,"merged":[[52,17,52,19],[80,4,83,8],[56,4,56,8],[57,4,57,8],[58,4,58,8],[59,4,59,8],[61,4,63,8],[64,4,64,8],[65,4,65,8],[66,4,66,8],[67,4,67,8],[69,4,78,8],[79,4,79,8],[84,4,84,8],[85,4,85,8],[87,5,87,6],[88,0,90,0],[88,5,89,6],[88,7,89,8],[90,5,91,6],[90,7,90,8],[99,4,99,8],[92,0,93,0],[92,2,93,2],[92,5,92,6],[92,7,92,8],[94,0,95,0],[94,2,95,2],[94,4,98,8]]}
["Decision & Control Parameters",null,null,"Valuations",null,null,null,"Tax Tables","2022/23","Tax Rate","Threshold","App 1","App 2","App 3","App 4"]
["Interest Rates","PA","Mthly","AVM",null,null,null,0,18200,0,0,0,0,0,0]
["Floor",0.05,{"$f":"+B3/12","v":4.1666666666666666E-3},"Max FSD",15,"Upgrade to DT",null,18201,45000,0.16,{"$f":"(I3-H3)*J3","v":4287.84},{"$f":"IF(OR(I$11=0,I$11<$H3),0,IF(I$11>$I3,$K3,(I$11-$H3)*$J3))","v":0},{"$f":"IF(OR(J$11=0,J$11<$H3),0,IF(J$11>$I3,$K3,(J$11-$H3)*$J3))","v":0},0,0]
["Buffer",0.02,{"$f":"+B4/12","v":1.6666666666666668E-3},"Desktop",null,null,null,45001,135000,0.3,{"$f":"(I4-H4)*J4","v":26999.7},{"$f":"IF(OR(I$11=0,I$11<$H4),0,IF(I$11>$I4,$K4,(I$11-$H4)*$J4))","v":0},0,0,0]
["Revolving",3.7999999999999999E-2,3.1666666666666666E-3,"Max Ppty Risk",750,"Upgrade to Full Val",null,135001,190000,0.37,20349.63,0,0,0,0]
["Actual Interest rate",{"$f":"'Servicing Calculator'!H5","v":0},0,"Max Market Risk",750,"Upgrade to Full Val",null,190001,null,0.45,null,{"$f":"IF(OR(I$11=0,I$11<H5),0,IF(I$11>$I5,(I$11-$I5)*$J6,0))","v":0},{"$f":"IF(OR(J$11=0,J$11<I5),0,IF(J$11>$I5,(J$11-$I5)*$J6,0))","v":0},0,0]
["HEM Buffer",1,null,"Full Inspection",null,null,null,"Total Tax",null,null,null,{"$f":"SUM(L2:L6)","v":0},{"$f":"SUM(M2:M6)","v":0},0,0]
["Min Acceptable Credit Score",650,null,"Risk Ratings",5," dual sign off required",null,"Medicare Levy",0.02]
["Max Loan Amount",3000000]
["Max TAE",5000000,null,null,null,null,null,"Working","App 1","App 2","App 3","App 4"]
{"$rows_left_out":57}
{"sheet":"Rental Incomes","index":4,"n_rows":14,"n_cols":8,"rows_kept":14,"cut":false,"hidden":true,"merged":[[1,0,1,1],[2,0,2,1]]}
["Investment Property Schedule"]
[]
[]
["Existing home loans from servicing calc page","Owner(s)","Inv Loan balance","Actual Interest %","Int deduction - Applicant 1","Int deduction - Applicant 2","Int deduction - Applicant 3","Int deduction - Applicant 4"]
["Existing home loan 1","Applicant 1",{"$f":"'Servicing Calculator'!E64","v":0},{"$f":"'Servicing Calculator'!F64","v":0},{"$f":"IF('Servicing Calculator'!$I64=\"Yes\",('Rental Incomes'!$C5*'Rental Incomes'!$D5*'Servicing Calculator'!J64),0)","v":0},{"$f":"IF('Servicing Calculator'!$I64=\"Yes\",('Rental Incomes'!$C5*'Rental Incomes'!$D5*'Servicing Calculator'!K64),0)","v":0},{"$f":"IF('Servicing Calculator'!$I64=\"Yes\",('Rental Incomes'!$C5*'Rental Incomes'!$D5*'Servicing Calculator'!L64),0)","v":0},{"$f":"IF('Servicing Calculator'!$I64=\"Yes\",('Rental Incomes'!$C5*'Rental Incomes'!$D5*'Servicing Calculator'!M64),0)","v":0}]
["Existing home loan 2","Applicant 2",{"$f":"'Servicing Calculator'!E65","v":0},{"$f":"'Servicing Calculator'!F65","v":0},{"$f":"IF('Servicing Calculator'!$I65=\"Yes\",('Rental Incomes'!$C6*'Rental Incomes'!$D6*'Servicing Calculator'!J65),0)","v":0},{"$f":"IF('Servicing Calculator'!$I65=\"Yes\",('Rental Incomes'!$C6*'Rental Incomes'!$D6*'Servicing Calculator'!K65),0)","v":0},{"$f":"IF('Servicing Calculator'!$I65=\"Yes\",('Rental Incomes'!$C6*'Rental Incomes'!$D6*'Servicing Calculator'!L65),0)","v":0},{"$f":"IF('Servicing Calculator'!$I65=\"Yes\",('Rental Incomes'!$C6*'Rental Incomes'!$D6*'Servicing Calculator'!M65),0)","v":0}]
["Existing home loan 3","Applicant 3",{"$f":"'Servicing Calculator'!E66","v":0},{"$f":"'Servicing Calculator'!F66","v":0},{"$f":"IF('Servicing Calculator'!$I66=\"Yes\",('Rental Incomes'!$C7*'Rental Incomes'!$D7*'Servicing Calculator'!J66),0)","v":0},{"$f":"IF('Servicing Calculator'!$I66=\"Yes\",('Rental Incomes'!$C7*'Rental Incomes'!$D7*'Servicing Calculator'!K66),0)","v":0},{"$f":"IF('Servicing Calculator'!$I66=\"Yes\",('Rental Incomes'!$C7*'Rental Incomes'!$D7*'Servicing Calculator'!L66),0)","v":0},{"$f":"IF('Servicing Calculator'!$I66=\"Yes\",('Rental Incomes'!$C7*'Rental Incomes'!$D7*'Servicing Calculator'!M66),0)","v":0}]
["Existing home loan 4","Applicant 4",{"$f":"'Servicing Calculator'!E67","v":0},{"$f":"'Servicing Calculator'!F67","v":0},{"$f":"IF('Servicing Calculator'!$I67=\"Yes\",('Rental Incomes'!$C8*'Rental Incomes'!$D8*'Servicing Calculator'!J67),0)","v":0},{"$f":"IF('Servicing Calculator'!$I67=\"Yes\",('Rental Incomes'!$C8*'Rental Incomes'!$D8*'Servicing Calculator'!K67),0)","v":0},{"$f":"IF('Servicing Calculator'!$I67=\"Yes\",('Rental Incomes'!$C8*'Rental Incomes'!$D8*'Servicing Calculator'!L67),0)","v":0},{"$f":"IF('Servicing Calculator'!$I67=\"Yes\",('Rental Incomes'!$C8*'Rental Incomes'!$D8*'Servicing Calculator'!M67),0)","v":0}]
["Existing home loan 5","Applicant 5",{"$f":"'Servicing Calculator'!E68","v":0},{"$f":"'Servicing Calculator'!F68","v":0},{"$f":"IF('Servicing Calculator'!$I68=\"Yes\",('Rental Incomes'!$C9*'Rental Incomes'!$D9*'Servicing Calculator'!J68),0)","v":0},{"$f":"IF('Servicing Calculator'!$I68=\"Yes\",('Rental Incomes'!$C9*'Rental Incomes'!$D9*'Servicing Calculator'!K68),0)","v":0},{"$f":"IF('Servicing Calculator'!$I68=\"Yes\",('Rental Incomes'!$C9*'Rental Incomes'!$D9*'Servicing Calculator'!L68),0)","v":0},{"$f":"IF('Servicing Calculator'!$I68=\"Yes\",('Rental Incomes'!$C9*'Rental Incomes'!$D9*'Servicing Calculator'!M68),0)","v":0}]
["Existing home loan 6","Applicant 6",{"$f":"'Servicing Calculator'!E69","v":0},{"$f":"'Servicing Calculator'!F69","v":0},{"$f":"IF('Servicing Calculator'!$I69=\"Yes\",('Rental Incomes'!$C10*'Rental Incomes'!$D10*'Servicing Calculator'!J69),0)","v":0},{"$f":"IF('Servicing Calculator'!$I69=\"Yes\",('Rental Incomes'!$C10*'Rental Incomes'!$D10*'Servicing Calculator'!K69),0)","v":0},{"$f":"IF('Servicing Calculator'!$I69=\"Yes\",('Rental Incomes'!$C10*'Rental Incomes'!$D10*'Servicing Calculator'!L69),0)","v":0},{"$f":"IF('Servicing Calculator'!$I69=\"Yes\",('Rental Incomes'!$C10*'Rental Incomes'!$D10*'Servicing Calculator'!M69),0)","v":0}]
{"$rows_left_out":4}